Jahia Install Forum > mvn install - fail...

0 (0 Good)
0 (0 Bad)

mvn install - fail to execute

by  johnkim »  2014/04/01 02:53

Hi,
I can't install jahia6. Because i met the error message during "mvn install" execution

- java : jdk1.7 64bit

- OS: Windows 7 64bit

-------------------------------------------------------------
 

[INFO] Jahia Felix SLF4j LogListener ..................... SUCCESS [1.061s]
[INFO] Jahia WAR ......................................... FAILURE [3:32.191s]
[INFO] Jahia Test Parent Package ......................... SKIPPED
[INFO] Jahia Test Module ................................. SKIPPED
[INFO] ------------------------------------------------------------------------
[INFO] BUILD FAILURE
[INFO] ------------------------------------------------------------------------
[INFO] Total time: 10:17.777s
[INFO] Finished at: Tue Apr 01 11:51:00 KST 2014
[INFO] Final Memory: 98M/525M
[INFO] ------------------------------------------------------------------------
[ERROR] Failed to execute goal org.jahia.server:jahia-maven-plugin:4.0:build-fra
mework-package-list (generate-package-export) on project jahia-war: Execution ge
nerate-package-export of goal org.jahia.server:jahia-maven-plugin:4.0:build-fram
ework-package-list failed: A required class was missing while executing org.jahi
a.server:jahia-maven-plugin:4.0:build-framework-package-list: org/sonatype/aethe
r/collection/DependencyCollectionException
[ERROR] -----------------------------------------------------
[ERROR] realm =    plugin>org.jahia.server:jahia-maven-plugin:4.0
[ERROR] strategy = org.codehaus.plexus.classworlds.strategy.SelfFirstStrategy
[ERROR] urls[0] = file:/C:/development/m2repository/org/jahia/server/jahia-maven
-plugin/4.0/jahia-maven-plugin-4.0.jar
[ERROR] urls[1] = file:/C:/development/m2repository/org/jahia/configuration/depl
oyers/4.0/deployers-4.0.jar
[ERROR] urls[2] = file:/C:/development/m2repository/org/jahia/configuration/conf
igurators/4.0/configurators-4.0.jar
[ERROR] urls[3] = file:/C:/development/m2repository/commons-beanutils/commons-be
anutils-core/1.8.3/commons-beanutils-core-1.8.3.jar
[ERROR] urls[4] = file:/C:/development/m2repository/commons-logging/commons-logg
ing/1.1.1/commons-logging-1.1.1.jar
[ERROR] urls[5] = file:/C:/development/m2repository/commons-vfs/commons-vfs/1.0/
commons-vfs-1.0.jar
[ERROR] urls[6] = file:/C:/development/m2repository/org/jdom/jdom/1.1/jdom-1.1.j
ar
[ERROR] urls[7] = file:/C:/development/m2repository/jaxen/jaxen/1.1.1/jaxen-1.1.
1.jar
[ERROR] urls[8] = file:/C:/development/m2repository/dom4j/dom4j/1.6.1/dom4j-1.6.
1.jar
[ERROR] urls[9] = file:/C:/development/m2repository/xerces/xercesImpl/2.6.2/xerc
esImpl-2.6.2.jar
[ERROR] urls[10] = file:/C:/development/m2repository/xom/xom/1.0/xom-1.0.jar
[ERROR] urls[11] = file:/C:/development/m2repository/xerces/xmlParserAPIs/2.6.2/
xmlParserAPIs-2.6.2.jar
[ERROR] urls[12] = file:/C:/development/m2repository/xalan/xalan/2.6.0/xalan-2.6
.0.jar
[ERROR] urls[13] = file:/C:/development/m2repository/com/ibm/icu/icu4j/2.6.1/icu
4j-2.6.1.jar
[ERROR] urls[14] = file:/C:/development/m2repository/mysql/mysql-connector-java/
5.1.29/mysql-connector-java-5.1.29.jar
[ERROR] urls[15] = file:/C:/development/m2repository/org/postgresql/postgresql/9
.3-1100-jdbc4/postgresql-9.3-1100-jdbc4.jar
[ERROR] urls[16] = file:/C:/development/m2repository/com/microsoft/sqlserver/sql
jdbc4/4.0.2206.100/sqljdbc4-4.0.2206.100.jar
[ERROR] urls[17] = file:/C:/development/m2repository/com/oracle/ojdbc6/12.1.0.1/
ojdbc6-12.1.0.1.jar
[ERROR] urls[18] = file:/C:/development/m2repository/com/oracle/orai18n/12.1.0.1
/orai18n-12.1.0.1.jar
[ERROR] urls[19] = file:/C:/development/m2repository/org/apache/derby/derbyclien
t/10.10.1.1/derbyclient-10.10.1.1.jar
[ERROR] urls[20] = file:/C:/development/m2repository/org/apache/derby/derby/10.1
0.1.1/derby-10.10.1.1.jar
[ERROR] urls[21] = file:/C:/development/m2repository/org/json/json/20070829/json
-20070829.jar
[ERROR] urls[22] = file:/C:/development/m2repository/org/jahia/configuration/osg
i-tools/4.0/osgi-tools-4.0.jar
[ERROR] urls[23] = file:/C:/development/m2repository/org/apache/jackrabbit/jackr
abbit-spi-commons/2.5.0/jackrabbit-spi-commons-2.5.0.jar
[ERROR] urls[24] = file:/C:/development/m2repository/org/apache/jackrabbit/jackr
abbit-spi/2.5.0/jackrabbit-spi-2.5.0.jar
[ERROR] urls[25] = file:/C:/development/m2repository/org/apache/jackrabbit/jackr
abbit-jcr-commons/2.5.0/jackrabbit-jcr-commons-2.5.0.jar
[ERROR] urls[26] = file:/C:/development/m2repository/asia/redact/bracket/propert
ies/bracket-properties/1.3.0/bracket-properties-1.3.0.jar
[ERROR] urls[27] = file:/C:/development/m2repository/log4j/log4j/1.2.16/log4j-1.
2.16.jar
[ERROR] urls[28] = file:/C:/development/m2repository/biz/aQute/bndlib/2.0.0.2013
0123-133441/bndlib-2.0.0.20130123-133441.jar
[ERROR] urls[29] = file:/C:/development/m2repository/javax/jcr/jcr/2.0/jcr-2.0.j
ar
[ERROR] urls[30] = file:/C:/development/m2repository/org/jdom/jdom2/2.0.5/jdom2-
2.0.5.jar
[ERROR] urls[31] = file:/C:/development/m2repository/commons-io/commons-io/2.0.1
/commons-io-2.0.1.jar
[ERROR] urls[32] = file:/C:/development/m2repository/commons-lang/commons-lang/2
.5/commons-lang-2.5.jar
[ERROR] urls[33] = file:/C:/development/m2repository/commons-codec/commons-codec
/1.4/commons-codec-1.4.jar
[ERROR] urls[34] = file:/C:/development/m2repository/org/sonatype/aether/aether-
util/1.13.1/aether-util-1.13.1.jar
[ERROR] urls[35] = file:/C:/development/m2repository/org/sonatype/sisu/sisu-inje
ct-bean/2.3.0/sisu-inject-bean-2.3.0.jar
[ERROR] urls[36] = file:/C:/development/m2repository/org/sonatype/sisu/sisu-guic
e/3.1.0/sisu-guice-3.1.0-no_aop.jar
[ERROR] urls[37] = file:/C:/development/m2repository/org/sonatype/sisu/sisu-guav
a/0.9.9/sisu-guava-0.9.9.jar
[ERROR] urls[38] = file:/C:/development/m2repository/org/codehaus/plexus/plexus-
interpolation/1.14/plexus-interpolation-1.14.jar
[ERROR] urls[39] = file:/C:/development/m2repository/org/codehaus/plexus/plexus-
component-annotations/1.5.5/plexus-component-annotations-1.5.5.jar
[ERROR] urls[40] = file:/C:/development/m2repository/org/sonatype/plexus/plexus-
sec-dispatcher/1.3/plexus-sec-dispatcher-1.3.jar
[ERROR] urls[41] = file:/C:/development/m2repository/org/sonatype/plexus/plexus-
cipher/1.4/plexus-cipher-1.4.jar
[ERROR] urls[42] = file:/C:/development/m2repository/org/apache/maven/shared/mav
en-dependency-tree/2.0/maven-dependency-tree-2.0.jar
[ERROR] urls[43] = file:/C:/development/m2repository/backport-util-concurrent/ba
ckport-util-concurrent/3.1/backport-util-concurrent-3.1.jar
[ERROR] urls[44] = file:/C:/development/m2repository/org/apache/maven/reporting/
maven-reporting-impl/2.2/maven-reporting-impl-2.2.jar
[ERROR] urls[45] = file:/C:/development/m2repository/org/apache/maven/reporting/
maven-reporting-api/3.0/maven-reporting-api-3.0.jar
[ERROR] urls[46] = file:/C:/development/m2repository/org/apache/maven/doxia/doxi
a-sink-api/1.2/doxia-sink-api-1.2.jar
[ERROR] urls[47] = file:/C:/development/m2repository/org/apache/maven/doxia/doxi
a-logging-api/1.2/doxia-logging-api-1.2.jar
[ERROR] urls[48] = file:/C:/development/m2repository/org/apache/maven/doxia/doxi
a-core/1.2/doxia-core-1.2.jar
[ERROR] urls[49] = file:/C:/development/m2repository/org/apache/httpcomponents/h
ttpclient/4.0.2/httpclient-4.0.2.jar
[ERROR] urls[50] = file:/C:/development/m2repository/org/apache/httpcomponents/h
ttpcore/4.0.1/httpcore-4.0.1.jar
[ERROR] urls[51] = file:/C:/development/m2repository/org/apache/maven/doxia/doxi
a-site-renderer/1.2/doxia-site-renderer-1.2.jar
[ERROR] urls[52] = file:/C:/development/m2repository/org/apache/maven/doxia/doxi
a-decoration-model/1.2/doxia-decoration-model-1.2.jar
[ERROR] urls[53] = file:/C:/development/m2repository/org/apache/maven/doxia/doxi
a-module-xhtml/1.2/doxia-module-xhtml-1.2.jar
[ERROR] urls[54] = file:/C:/development/m2repository/org/apache/maven/doxia/doxi
a-module-fml/1.2/doxia-module-fml-1.2.jar
[ERROR] urls[55] = file:/C:/development/m2repository/org/codehaus/plexus/plexus-
i18n/1.0-beta-7/plexus-i18n-1.0-beta-7.jar
[ERROR] urls[56] = file:/C:/development/m2repository/org/codehaus/plexus/plexus-
velocity/1.1.7/plexus-velocity-1.1.7.jar
[ERROR] urls[57] = file:/C:/development/m2repository/org/apache/velocity/velocit
y/1.5/velocity-1.5.jar
[ERROR] urls[58] = file:/C:/development/m2repository/oro/oro/2.0.8/oro-2.0.8.jar

[ERROR] urls[59] = file:/C:/development/m2repository/commons-validator/commons-v
alidator/1.3.1/commons-validator-1.3.1.jar
[ERROR] urls[60] = file:/C:/development/m2repository/commons-beanutils/commons-b
eanutils/1.7.0/commons-beanutils-1.7.0.jar
[ERROR] urls[61] = file:/C:/development/m2repository/commons-digester/commons-di
gester/1.6/commons-digester-1.6.jar
[ERROR] urls[62] = file:/C:/development/m2repository/xml-apis/xml-apis/1.0.b2/xm
l-apis-1.0.b2.jar
[ERROR] urls[63] = file:/C:/development/m2repository/org/codehaus/plexus/plexus-
utils/3.0.1/plexus-utils-3.0.1.jar
[ERROR] urls[64] = file:/C:/development/m2repository/com/sun/tools/1.5.0/tools-1
.5.0.jar
[ERROR] urls[65] = file:/C:/development/m2repository/taglibrarydoc/tlddoc/1.3/tl
ddoc-1.3.jar
[ERROR] urls[66] = file:/C:/development/m2repository/org/slf4j/slf4j-api/1.7.2/s
lf4j-api-1.7.2.jar
[ERROR] urls[67] = file:/C:/development/m2repository/org/slf4j/slf4j-simple/1.7.
2/slf4j-simple-1.7.2.jar
[ERROR] urls[68] = file:/C:/development/m2repository/org/apache/ant/ant-nodeps/1
.8.1/ant-nodeps-1.8.1.jar
[ERROR] urls[69] = file:/C:/development/m2repository/org/apache/ant/ant/1.8.1/an
t-1.8.1.jar
[ERROR] urls[70] = file:/C:/development/m2repository/org/apache/ant/ant-launcher
/1.8.1/ant-launcher-1.8.1.jar
[ERROR] urls[71] = file:/C:/development/m2repository/org/codehaus/plexus/plexus-
archiver/1.0-alpha-12/plexus-archiver-1.0-alpha-12.jar
[ERROR] urls[72] = file:/C:/development/m2repository/junit/junit/3.8.1/junit-3.8
.1.jar
[ERROR] urls[73] = file:/C:/development/m2repository/org/codehaus/plexus/plexus-
io/1.0-alpha-4/plexus-io-1.0-alpha-4.jar
[ERROR] urls[74] = file:/C:/development/m2repository/commons-collections/commons
-collections/3.2.1/commons-collections-3.2.1.jar
[ERROR] urls[75] = file:/C:/development/m2repository/org/apache/tika/tika-parser
s/1.2/tika-parsers-1.2.jar
[ERROR] urls[76] = file:/C:/development/m2repository/org/apache/tika/tika-core/1
.2/tika-core-1.2.jar
[ERROR] urls[77] = file:/C:/development/m2repository/org/gagravarr/vorbis-java-t
ika/0.1/vorbis-java-tika-0.1.jar
[ERROR] urls[78] = file:/C:/development/m2repository/org/gagravarr/vorbis-java-c
ore/0.1/vorbis-java-core-0.1-tests.jar
[ERROR] urls[79] = file:/C:/development/m2repository/edu/ucar/netcdf/4.2-min/net
cdf-4.2-min.jar
[ERROR] urls[80] = file:/C:/development/m2repository/org/apache/james/apache-mim
e4j-core/0.7.2/apache-mime4j-core-0.7.2.jar
[ERROR] urls[81] = file:/C:/development/m2repository/org/apache/james/apache-mim
e4j-dom/0.7.2/apache-mime4j-dom-0.7.2.jar
[ERROR] urls[82] = file:/C:/development/m2repository/org/apache/commons/commons-
compress/1.4.1/commons-compress-1.4.1.jar
[ERROR] urls[83] = file:/C:/development/m2repository/org/tukaani/xz/1.0/xz-1.0.j
ar
[ERROR] urls[84] = file:/C:/development/m2repository/org/apache/pdfbox/pdfbox/1.
7.0/pdfbox-1.7.0.jar
[ERROR] urls[85] = file:/C:/development/m2repository/org/apache/pdfbox/fontbox/1
.7.0/fontbox-1.7.0.jar
[ERROR] urls[86] = file:/C:/development/m2repository/org/apache/pdfbox/jempbox/1
.7.0/jempbox-1.7.0.jar
[ERROR] urls[87] = file:/C:/development/m2repository/org/bouncycastle/bcmail-jdk
15/1.45/bcmail-jdk15-1.45.jar
[ERROR] urls[88] = file:/C:/development/m2repository/org/bouncycastle/bcprov-jdk
15/1.45/bcprov-jdk15-1.45.jar
[ERROR] urls[89] = file:/C:/development/m2repository/org/apache/poi/poi/3.8/poi-
3.8.jar
[ERROR] urls[90] = file:/C:/development/m2repository/org/apache/poi/poi-scratchp
ad/3.8/poi-scratchpad-3.8.jar
[ERROR] urls[91] = file:/C:/development/m2repository/org/apache/poi/poi-ooxml/3.
8/poi-ooxml-3.8.jar
[ERROR] urls[92] = file:/C:/development/m2repository/org/apache/poi/poi-ooxml-sc
hemas/3.8/poi-ooxml-schemas-3.8.jar
[ERROR] urls[93] = file:/C:/development/m2repository/org/apache/xmlbeans/xmlbean
s/2.3.0/xmlbeans-2.3.0.jar
[ERROR] urls[94] = file:/C:/development/m2repository/org/apache/geronimo/specs/g
eronimo-stax-api_1.0_spec/1.0.1/geronimo-stax-api_1.0_spec-1.0.1.jar
[ERROR] urls[95] = file:/C:/development/m2repository/org/ccil/cowan/tagsoup/tags
oup/1.2.1/tagsoup-1.2.1.jar
[ERROR] urls[96] = file:/C:/development/m2repository/asm/asm/3.1/asm-3.1.jar
[ERROR] urls[97] = file:/C:/development/m2repository/com/googlecode/mp4parser/is
oparser/1.0-RC-1/isoparser-1.0-RC-1.jar
[ERROR] urls[98] = file:/C:/development/m2repository/org/aspectj/aspectjrt/1.6.1
1/aspectjrt-1.6.11.jar
[ERROR] urls[99] = file:/C:/development/m2repository/com/drewnoakes/metadata-ext
ractor/2.4.0-beta-1/metadata-extractor-2.4.0-beta-1.jar
[ERROR] urls[100] = file:/C:/development/m2repository/de/l3s/boilerpipe/boilerpi
pe/1.1.0/boilerpipe-1.1.0.jar
[ERROR] urls[101] = file:/C:/development/m2repository/rome/rome/0.9/rome-0.9.jar

[ERROR] urls[102] = file:/C:/development/m2repository/jdom/jdom/1.0/jdom-1.0.jar

[ERROR] urls[103] = file:/C:/development/m2repository/org/gagravarr/vorbis-java-
core/0.1/vorbis-java-core-0.1.jar
[ERROR] urls[104] = file:/C:/development/m2repository/com/googlecode/juniversalc
hardet/juniversalchardet/1.0.3/juniversalchardet-1.0.3.jar
[ERROR] urls[105] = file:/C:/development/m2repository/org/apache/maven/plugin-to
ols/maven-plugin-annotations/3.1/maven-plugin-annotations-3.1.jar
[ERROR] urls[106] = file:/C:/development/m2repository/org/eclipse/tycho/org.ecli
pse.osgi/3.8.1.v20120830-144521/org.eclipse.osgi-3.8.1.v20120830-144521.jar
[ERROR] urls[107] = file:/C:/development/m2repository/org/jahia/commons/jahia-co
mmons/1.0.4/jahia-commons-1.0.4.jar
[ERROR] urls[108] = file:/C:/development/m2repository/org/jahia/configuration/mi
grators/4.0/migrators-4.0.jar
[ERROR] Number of foreign imports: 1
[ERROR] import: Entry[import  from realm ClassRealm[project>org.jahia.server:jah
ia-taglib:7.0.1.0-SNAPSHOT, parent: ClassRealm[maven.api, parent: null]]]
[ERROR]
[ERROR] -----------------------------------------------------: org.sonatype.aeth
er.collection.DependencyCollectionException
[ERROR] -> [Help 1]
[ERROR]
[ERROR] To see the full stack trace of the errors, re-run Maven with the -e swit
ch.
[ERROR] Re-run Maven using the -X switch to enable full debug logging.
[ERROR]
[ERROR] For more information about the errors and possible solutions, please rea
d the following articles:
[ERROR] [Help 1] http://cwiki.apache.org/confluence/display/MAVEN/AetherClassNot
Found
[ERROR]
[ERROR] After correcting the problems, you can resume the build with the command

[ERROR]   mvn <goals> -rf :jahia-war

 

 

  • mvn install - fail to execute
    2014/04/01 02:53

    johnkim <h4 class="forum-h4-first"> Hi,<br /> I can&#39;t install jahia6. Because i met the error message during &quot;mvn install&quot; execution</h4> <div class="content editablePost" id="edit22e9ca39-3fcc-45e5-be31-a8e3fd19c54a" jcr:id="content" jcr:url="/home/community/forum/jahia-user/jahia-install-forum/install-jahia-on-windows-server/mvn-install---fail-to-execute"> <p> - java : jdk1.7 64bit</p> <p> - OS: Windows 7 64bit</p> <p> -------------------------------------------------------------<br /> &nbsp;</p> <p> [INFO] Jahia Felix SLF4j LogListener ..................... SUCCESS [1.061s]<br /> [INFO] Jahia WAR ......................................... FAILURE [3:32.191s]<br /> [INFO] Jahia Test Parent Package ......................... SKIPPED<br /> [INFO] Jahia Test Module ................................. SKIPPED<br /> [INFO] ------------------------------------------------------------------------<br /> [INFO] BUILD FAILURE<br /> [INFO] ------------------------------------------------------------------------<br /> [INFO] Total time: 10:17.777s<br /> [INFO] Finished at: Tue Apr 01 11:51:00 KST 2014<br /> [INFO] Final Memory: 98M/525M<br /> [INFO] ------------------------------------------------------------------------<br /> [ERROR] Failed to execute goal org.jahia.server:jahia-maven-plugin:4.0:build-fra<br /> mework-package-list (generate-package-export) on project jahia-war: Execution ge<br /> nerate-package-export of goal org.jahia.server:jahia-maven-plugin:4.0:build-fram<br /> ework-package-list failed: A required class was missing while executing org.jahi<br /> a.server:jahia-maven-plugin:4.0:build-framework-package-list: org/sonatype/aethe<br /> r/collection/DependencyCollectionException<br /> [ERROR] -----------------------------------------------------<br /> [ERROR] realm =&nbsp;&nbsp;&nbsp; plugin&gt;org.jahia.server:jahia-maven-plugin:4.0<br /> [ERROR] strategy = org.codehaus.plexus.classworlds.strategy.SelfFirstStrategy<br /> [ERROR] urls[0] = file:/C:/development/m2repository/org/jahia/server/jahia-maven<br /> -plugin/4.0/jahia-maven-plugin-4.0.jar<br /> [ERROR] urls[1] = file:/C:/development/m2repository/org/jahia/configuration/depl<br /> oyers/4.0/deployers-4.0.jar<br /> [ERROR] urls[2] = file:/C:/development/m2repository/org/jahia/configuration/conf<br /> igurators/4.0/configurators-4.0.jar<br /> [ERROR] urls[3] = file:/C:/development/m2repository/commons-beanutils/commons-be<br /> anutils-core/1.8.3/commons-beanutils-core-1.8.3.jar<br /> [ERROR] urls[4] = file:/C:/development/m2repository/commons-logging/commons-logg<br /> ing/1.1.1/commons-logging-1.1.1.jar<br /> [ERROR] urls[5] = file:/C:/development/m2repository/commons-vfs/commons-vfs/1.0/<br /> commons-vfs-1.0.jar<br /> [ERROR] urls[6] = file:/C:/development/m2repository/org/jdom/jdom/1.1/jdom-1.1.j<br /> ar<br /> [ERROR] urls[7] = file:/C:/development/m2repository/jaxen/jaxen/1.1.1/jaxen-1.1.<br /> 1.jar<br /> [ERROR] urls[8] = file:/C:/development/m2repository/dom4j/dom4j/1.6.1/dom4j-1.6.<br /> 1.jar<br /> [ERROR] urls[9] = file:/C:/development/m2repository/xerces/xercesImpl/2.6.2/xerc<br /> esImpl-2.6.2.jar<br /> [ERROR] urls[10] = file:/C:/development/m2repository/xom/xom/1.0/xom-1.0.jar<br /> [ERROR] urls[11] = file:/C:/development/m2repository/xerces/xmlParserAPIs/2.6.2/<br /> xmlParserAPIs-2.6.2.jar<br /> [ERROR] urls[12] = file:/C:/development/m2repository/xalan/xalan/2.6.0/xalan-2.6<br /> .0.jar<br /> [ERROR] urls[13] = file:/C:/development/m2repository/com/ibm/icu/icu4j/2.6.1/icu<br /> 4j-2.6.1.jar<br /> [ERROR] urls[14] = file:/C:/development/m2repository/mysql/mysql-connector-java/<br /> 5.1.29/mysql-connector-java-5.1.29.jar<br /> [ERROR] urls[15] = file:/C:/development/m2repository/org/postgresql/postgresql/9<br /> .3-1100-jdbc4/postgresql-9.3-1100-jdbc4.jar<br /> [ERROR] urls[16] = file:/C:/development/m2repository/com/microsoft/sqlserver/sql<br /> jdbc4/4.0.2206.100/sqljdbc4-4.0.2206.100.jar<br /> [ERROR] urls[17] = file:/C:/development/m2repository/com/oracle/ojdbc6/12.1.0.1/<br /> ojdbc6-12.1.0.1.jar<br /> [ERROR] urls[18] = file:/C:/development/m2repository/com/oracle/orai18n/12.1.0.1<br /> /orai18n-12.1.0.1.jar<br /> [ERROR] urls[19] = file:/C:/development/m2repository/org/apache/derby/derbyclien<br /> t/10.10.1.1/derbyclient-10.10.1.1.jar<br /> [ERROR] urls[20] = file:/C:/development/m2repository/org/apache/derby/derby/10.1<br /> 0.1.1/derby-10.10.1.1.jar<br /> [ERROR] urls[21] = file:/C:/development/m2repository/org/json/json/20070829/json<br /> -20070829.jar<br /> [ERROR] urls[22] = file:/C:/development/m2repository/org/jahia/configuration/osg<br /> i-tools/4.0/osgi-tools-4.0.jar<br /> [ERROR] urls[23] = file:/C:/development/m2repository/org/apache/jackrabbit/jackr<br /> abbit-spi-commons/2.5.0/jackrabbit-spi-commons-2.5.0.jar<br /> [ERROR] urls[24] = file:/C:/development/m2repository/org/apache/jackrabbit/jackr<br /> abbit-spi/2.5.0/jackrabbit-spi-2.5.0.jar<br /> [ERROR] urls[25] = file:/C:/development/m2repository/org/apache/jackrabbit/jackr<br /> abbit-jcr-commons/2.5.0/jackrabbit-jcr-commons-2.5.0.jar<br /> [ERROR] urls[26] = file:/C:/development/m2repository/asia/redact/bracket/propert<br /> ies/bracket-properties/1.3.0/bracket-properties-1.3.0.jar<br /> [ERROR] urls[27] = file:/C:/development/m2repository/log4j/log4j/1.2.16/log4j-1.<br /> 2.16.jar<br /> [ERROR] urls[28] = file:/C:/development/m2repository/biz/aQute/bndlib/2.0.0.2013<br /> 0123-133441/bndlib-2.0.0.20130123-133441.jar<br /> [ERROR] urls[29] = file:/C:/development/m2repository/javax/jcr/jcr/2.0/jcr-2.0.j<br /> ar<br /> [ERROR] urls[30] = file:/C:/development/m2repository/org/jdom/jdom2/2.0.5/jdom2-<br /> 2.0.5.jar<br /> [ERROR] urls[31] = file:/C:/development/m2repository/commons-io/commons-io/2.0.1<br /> /commons-io-2.0.1.jar<br /> [ERROR] urls[32] = file:/C:/development/m2repository/commons-lang/commons-lang/2<br /> .5/commons-lang-2.5.jar<br /> [ERROR] urls[33] = file:/C:/development/m2repository/commons-codec/commons-codec<br /> /1.4/commons-codec-1.4.jar<br /> [ERROR] urls[34] = file:/C:/development/m2repository/org/sonatype/aether/aether-<br /> util/1.13.1/aether-util-1.13.1.jar<br /> [ERROR] urls[35] = file:/C:/development/m2repository/org/sonatype/sisu/sisu-inje<br /> ct-bean/2.3.0/sisu-inject-bean-2.3.0.jar<br /> [ERROR] urls[36] = file:/C:/development/m2repository/org/sonatype/sisu/sisu-guic<br /> e/3.1.0/sisu-guice-3.1.0-no_aop.jar<br /> [ERROR] urls[37] = file:/C:/development/m2repository/org/sonatype/sisu/sisu-guav<br /> a/0.9.9/sisu-guava-0.9.9.jar<br /> [ERROR] urls[38] = file:/C:/development/m2repository/org/codehaus/plexus/plexus-<br /> interpolation/1.14/plexus-interpolation-1.14.jar<br /> [ERROR] urls[39] = file:/C:/development/m2repository/org/codehaus/plexus/plexus-<br /> component-annotations/1.5.5/plexus-component-annotations-1.5.5.jar<br /> [ERROR] urls[40] = file:/C:/development/m2repository/org/sonatype/plexus/plexus-<br /> sec-dispatcher/1.3/plexus-sec-dispatcher-1.3.jar<br /> [ERROR] urls[41] = file:/C:/development/m2repository/org/sonatype/plexus/plexus-<br /> cipher/1.4/plexus-cipher-1.4.jar<br /> [ERROR] urls[42] = file:/C:/development/m2repository/org/apache/maven/shared/mav<br /> en-dependency-tree/2.0/maven-dependency-tree-2.0.jar<br /> [ERROR] urls[43] = file:/C:/development/m2repository/backport-util-concurrent/ba<br /> ckport-util-concurrent/3.1/backport-util-concurrent-3.1.jar<br /> [ERROR] urls[44] = file:/C:/development/m2repository/org/apache/maven/reporting/<br /> maven-reporting-impl/2.2/maven-reporting-impl-2.2.jar<br /> [ERROR] urls[45] = file:/C:/development/m2repository/org/apache/maven/reporting/<br /> maven-reporting-api/3.0/maven-reporting-api-3.0.jar<br /> [ERROR] urls[46] = file:/C:/development/m2repository/org/apache/maven/doxia/doxi<br /> a-sink-api/1.2/doxia-sink-api-1.2.jar<br /> [ERROR] urls[47] = file:/C:/development/m2repository/org/apache/maven/doxia/doxi<br /> a-logging-api/1.2/doxia-logging-api-1.2.jar<br /> [ERROR] urls[48] = file:/C:/development/m2repository/org/apache/maven/doxia/doxi<br /> a-core/1.2/doxia-core-1.2.jar<br /> [ERROR] urls[49] = file:/C:/development/m2repository/org/apache/httpcomponents/h<br /> ttpclient/4.0.2/httpclient-4.0.2.jar<br /> [ERROR] urls[50] = file:/C:/development/m2repository/org/apache/httpcomponents/h<br /> ttpcore/4.0.1/httpcore-4.0.1.jar<br /> [ERROR] urls[51] = file:/C:/development/m2repository/org/apache/maven/doxia/doxi<br /> a-site-renderer/1.2/doxia-site-renderer-1.2.jar<br /> [ERROR] urls[52] = file:/C:/development/m2repository/org/apache/maven/doxia/doxi<br /> a-decoration-model/1.2/doxia-decoration-model-1.2.jar<br /> [ERROR] urls[53] = file:/C:/development/m2repository/org/apache/maven/doxia/doxi<br /> a-module-xhtml/1.2/doxia-module-xhtml-1.2.jar<br /> [ERROR] urls[54] = file:/C:/development/m2repository/org/apache/maven/doxia/doxi<br /> a-module-fml/1.2/doxia-module-fml-1.2.jar<br /> [ERROR] urls[55] = file:/C:/development/m2repository/org/codehaus/plexus/plexus-<br /> i18n/1.0-beta-7/plexus-i18n-1.0-beta-7.jar<br /> [ERROR] urls[56] = file:/C:/development/m2repository/org/codehaus/plexus/plexus-<br /> velocity/1.1.7/plexus-velocity-1.1.7.jar<br /> [ERROR] urls[57] = file:/C:/development/m2repository/org/apache/velocity/velocit<br /> y/1.5/velocity-1.5.jar<br /> [ERROR] urls[58] = file:/C:/development/m2repository/oro/oro/2.0.8/oro-2.0.8.jar</p> <p> [ERROR] urls[59] = file:/C:/development/m2repository/commons-validator/commons-v<br /> alidator/1.3.1/commons-validator-1.3.1.jar<br /> [ERROR] urls[60] = file:/C:/development/m2repository/commons-beanutils/commons-b<br /> eanutils/1.7.0/commons-beanutils-1.7.0.jar<br /> [ERROR] urls[61] = file:/C:/development/m2repository/commons-digester/commons-di<br /> gester/1.6/commons-digester-1.6.jar<br /> [ERROR] urls[62] = file:/C:/development/m2repository/xml-apis/xml-apis/1.0.b2/xm<br /> l-apis-1.0.b2.jar<br /> [ERROR] urls[63] = file:/C:/development/m2repository/org/codehaus/plexus/plexus-<br /> utils/3.0.1/plexus-utils-3.0.1.jar<br /> [ERROR] urls[64] = file:/C:/development/m2repository/com/sun/tools/1.5.0/tools-1<br /> .5.0.jar<br /> [ERROR] urls[65] = file:/C:/development/m2repository/taglibrarydoc/tlddoc/1.3/tl<br /> ddoc-1.3.jar<br /> [ERROR] urls[66] = file:/C:/development/m2repository/org/slf4j/slf4j-api/1.7.2/s<br /> lf4j-api-1.7.2.jar<br /> [ERROR] urls[67] = file:/C:/development/m2repository/org/slf4j/slf4j-simple/1.7.<br /> 2/slf4j-simple-1.7.2.jar<br /> [ERROR] urls[68] = file:/C:/development/m2repository/org/apache/ant/ant-nodeps/1<br /> .8.1/ant-nodeps-1.8.1.jar<br /> [ERROR] urls[69] = file:/C:/development/m2repository/org/apache/ant/ant/1.8.1/an<br /> t-1.8.1.jar<br /> [ERROR] urls[70] = file:/C:/development/m2repository/org/apache/ant/ant-launcher<br /> /1.8.1/ant-launcher-1.8.1.jar<br /> [ERROR] urls[71] = file:/C:/development/m2repository/org/codehaus/plexus/plexus-<br /> archiver/1.0-alpha-12/plexus-archiver-1.0-alpha-12.jar<br /> [ERROR] urls[72] = file:/C:/development/m2repository/junit/junit/3.8.1/junit-3.8<br /> .1.jar<br /> [ERROR] urls[73] = file:/C:/development/m2repository/org/codehaus/plexus/plexus-<br /> io/1.0-alpha-4/plexus-io-1.0-alpha-4.jar<br /> [ERROR] urls[74] = file:/C:/development/m2repository/commons-collections/commons<br /> -collections/3.2.1/commons-collections-3.2.1.jar<br /> [ERROR] urls[75] = file:/C:/development/m2repository/org/apache/tika/tika-parser<br /> s/1.2/tika-parsers-1.2.jar<br /> [ERROR] urls[76] = file:/C:/development/m2repository/org/apache/tika/tika-core/1<br /> .2/tika-core-1.2.jar<br /> [ERROR] urls[77] = file:/C:/development/m2repository/org/gagravarr/vorbis-java-t<br /> ika/0.1/vorbis-java-tika-0.1.jar<br /> [ERROR] urls[78] = file:/C:/development/m2repository/org/gagravarr/vorbis-java-c<br /> ore/0.1/vorbis-java-core-0.1-tests.jar<br /> [ERROR] urls[79] = file:/C:/development/m2repository/edu/ucar/netcdf/4.2-min/net<br /> cdf-4.2-min.jar<br /> [ERROR] urls[80] = file:/C:/development/m2repository/org/apache/james/apache-mim<br /> e4j-core/0.7.2/apache-mime4j-core-0.7.2.jar<br /> [ERROR] urls[81] = file:/C:/development/m2repository/org/apache/james/apache-mim<br /> e4j-dom/0.7.2/apache-mime4j-dom-0.7.2.jar<br /> [ERROR] urls[82] = file:/C:/development/m2repository/org/apache/commons/commons-<br /> compress/1.4.1/commons-compress-1.4.1.jar<br /> [ERROR] urls[83] = file:/C:/development/m2repository/org/tukaani/xz/1.0/xz-1.0.j<br /> ar<br /> [ERROR] urls[84] = file:/C:/development/m2repository/org/apache/pdfbox/pdfbox/1.<br /> 7.0/pdfbox-1.7.0.jar<br /> [ERROR] urls[85] = file:/C:/development/m2repository/org/apache/pdfbox/fontbox/1<br /> .7.0/fontbox-1.7.0.jar<br /> [ERROR] urls[86] = file:/C:/development/m2repository/org/apache/pdfbox/jempbox/1<br /> .7.0/jempbox-1.7.0.jar<br /> [ERROR] urls[87] = file:/C:/development/m2repository/org/bouncycastle/bcmail-jdk<br /> 15/1.45/bcmail-jdk15-1.45.jar<br /> [ERROR] urls[88] = file:/C:/development/m2repository/org/bouncycastle/bcprov-jdk<br /> 15/1.45/bcprov-jdk15-1.45.jar<br /> [ERROR] urls[89] = file:/C:/development/m2repository/org/apache/poi/poi/3.8/poi-<br /> 3.8.jar<br /> [ERROR] urls[90] = file:/C:/development/m2repository/org/apache/poi/poi-scratchp<br /> ad/3.8/poi-scratchpad-3.8.jar<br /> [ERROR] urls[91] = file:/C:/development/m2repository/org/apache/poi/poi-ooxml/3.<br /> 8/poi-ooxml-3.8.jar<br /> [ERROR] urls[92] = file:/C:/development/m2repository/org/apache/poi/poi-ooxml-sc<br /> hemas/3.8/poi-ooxml-schemas-3.8.jar<br /> [ERROR] urls[93] = file:/C:/development/m2repository/org/apache/xmlbeans/xmlbean<br /> s/2.3.0/xmlbeans-2.3.0.jar<br /> [ERROR] urls[94] = file:/C:/development/m2repository/org/apache/geronimo/specs/g<br /> eronimo-stax-api_1.0_spec/1.0.1/geronimo-stax-api_1.0_spec-1.0.1.jar<br /> [ERROR] urls[95] = file:/C:/development/m2repository/org/ccil/cowan/tagsoup/tags<br /> oup/1.2.1/tagsoup-1.2.1.jar<br /> [ERROR] urls[96] = file:/C:/development/m2repository/asm/asm/3.1/asm-3.1.jar<br /> [ERROR] urls[97] = file:/C:/development/m2repository/com/googlecode/mp4parser/is<br /> oparser/1.0-RC-1/isoparser-1.0-RC-1.jar<br /> [ERROR] urls[98] = file:/C:/development/m2repository/org/aspectj/aspectjrt/1.6.1<br /> 1/aspectjrt-1.6.11.jar<br /> [ERROR] urls[99] = file:/C:/development/m2repository/com/drewnoakes/metadata-ext<br /> ractor/2.4.0-beta-1/metadata-extractor-2.4.0-beta-1.jar<br /> [ERROR] urls[100] = file:/C:/development/m2repository/de/l3s/boilerpipe/boilerpi<br /> pe/1.1.0/boilerpipe-1.1.0.jar<br /> [ERROR] urls[101] = file:/C:/development/m2repository/rome/rome/0.9/rome-0.9.jar</p> <p> [ERROR] urls[102] = file:/C:/development/m2repository/jdom/jdom/1.0/jdom-1.0.jar</p> <p> [ERROR] urls[103] = file:/C:/development/m2repository/org/gagravarr/vorbis-java-<br /> core/0.1/vorbis-java-core-0.1.jar<br /> [ERROR] urls[104] = file:/C:/development/m2repository/com/googlecode/juniversalc<br /> hardet/juniversalchardet/1.0.3/juniversalchardet-1.0.3.jar<br /> [ERROR] urls[105] = file:/C:/development/m2repository/org/apache/maven/plugin-to<br /> ols/maven-plugin-annotations/3.1/maven-plugin-annotations-3.1.jar<br /> [ERROR] urls[106] = file:/C:/development/m2repository/org/eclipse/tycho/org.ecli<br /> pse.osgi/3.8.1.v20120830-144521/org.eclipse.osgi-3.8.1.v20120830-144521.jar<br /> [ERROR] urls[107] = file:/C:/development/m2repository/org/jahia/commons/jahia-co<br /> mmons/1.0.4/jahia-commons-1.0.4.jar<br /> [ERROR] urls[108] = file:/C:/development/m2repository/org/jahia/configuration/mi<br /> grators/4.0/migrators-4.0.jar<br /> [ERROR] Number of foreign imports: 1<br /> [ERROR] import: Entry[import&nbsp; from realm ClassRealm[project&gt;org.jahia.server:jah<br /> ia-taglib:7.0.1.0-SNAPSHOT, parent: ClassRealm[maven.api, parent: null]]]<br /> [ERROR]<br /> [ERROR] -----------------------------------------------------: org.sonatype.aeth<br /> er.collection.DependencyCollectionException<br /> [ERROR] -&gt; [Help 1]<br /> [ERROR]<br /> [ERROR] To see the full stack trace of the errors, re-run Maven with the -e swit<br /> ch.<br /> [ERROR] Re-run Maven using the -X switch to enable full debug logging.<br /> [ERROR]<br /> [ERROR] For more information about the errors and possible solutions, please rea<br /> d the following articles:<br /> [ERROR] [Help 1] <a href="http://cwiki.apache.org/confluence/display/MAVEN/AetherClassNot">http://cwiki.apache.org/confluence/display/MAVEN/AetherClassNot</a><br /> Found<br /> [ERROR]<br /> [ERROR] After correcting the problems, you can resume the build with the command</p> <p> [ERROR]&nbsp;&nbsp; mvn &lt;goals&gt; -rf :jahia-war</p> <p> &nbsp;</p> </div> <p> &nbsp;</p>

  • Number of messages  4
    Registration date Apr 1, 2014
    1 (1 Good)
    0 (0 Bad)

    Re: mvn install - fail to execute

    by  shyrkov »  2014/04/01 08:11

    Hello John,

     

    seems you are using Maven 3.1.x for building Jahia.

    Jahia currently only supports 3.0.x.

    Please give it a try.

     

    Kind regards

    Sergiy

  • Re: mvn install - fail to execute
    2014/04/01 09:27

    shyrkov <p> Hello John,</p> <p> &nbsp;</p> <p> seems you are using Maven 3.1.x for building Jahia.</p> <p> Jahia currently only supports 3.0.x.</p> <p> Please give it a try.</p> <p> &nbsp;</p> <p> Kind regards</p> <p> Sergiy</p>

  • Number of messages  407
    Registration date Apr 1, 2014
    0 (0 Good)
    0 (0 Bad)

    Re: Re: mvn install - fail to execute

    by  johnkim »  2014/04/01 09:26

    Thanks, shyrkov.

    I tried using maven 3.0.x

    But I met a next error message:

    ---------------------------------------------------------------------------------------------------

    [INFO] Jahia WAR ......................................... SUCCESS [5:57.856s]
    [INFO] Jahia Test Parent Package ......................... SUCCESS [0.130s]
    [INFO] Jahia Test Module ................................. FAILURE [16.504s]
    [INFO] ------------------------------------------------------------------------
    [INFO] BUILD FAILURE
    [INFO] ------------------------------------------------------------------------
    [INFO] Total time: 16:09.465s
    [INFO] Finished at: Tue Apr 01 18:20:11 KST 2014
    [INFO] Final Memory: 108M/623M
    [INFO] ------------------------------------------------------------------------
    [ERROR] Failed to execute goal org.apache.maven.plugins:maven-dependency-plugin:
    2.8:copy (copy) on project jahia-test-module: Unable to find artifact. Could not
     find artifact org.jahia.modules:dummy1:jar:1.0 in jahia-public (https://devtool
    s.jahia.com/nexus/content/groups/public)
    [ERROR]
    [ERROR] Try downloading the file manually from the project website.
    [ERROR]
    [ERROR] Then, install it using the command:
    [ERROR] mvn install:install-file -DgroupId=org.jahia.modules -DartifactId=dummy1
     -Dversion=1.0 -Dpackaging=jar -Dfile=/path/to/file
    [ERROR]
    [ERROR] Alternatively, if you host your own repository you can deploy the file t
    here:
    [ERROR] mvn deploy:deploy-file -DgroupId=org.jahia.modules -DartifactId=dummy1 -
    Dversion=1.0 -Dpackaging=jar -Dfile=/path/to/file -Durl=[url] -DrepositoryId=[id
    ]

  • Re: Re: mvn install - fail to execute
    2014/04/01 09:26

    johnkim <p> <strong>Thanks, shyrkov.</strong></p> <p> <strong>I tried using maven 3.0.x</strong></p> <p> <strong>But I met a next error message:</strong></p> <p> ---------------------------------------------------------------------------------------------------</p> <p> [INFO] Jahia WAR ......................................... SUCCESS [5:57.856s]<br /> [INFO] Jahia Test Parent Package ......................... SUCCESS [0.130s]<br /> [INFO] Jahia Test Module ................................. FAILURE [16.504s]<br /> [INFO] ------------------------------------------------------------------------<br /> [INFO] BUILD FAILURE<br /> [INFO] ------------------------------------------------------------------------<br /> [INFO] Total time: 16:09.465s<br /> [INFO] Finished at: Tue Apr 01 18:20:11 KST 2014<br /> [INFO] Final Memory: 108M/623M<br /> [INFO] ------------------------------------------------------------------------<br /> [ERROR] Failed to execute goal org.apache.maven.plugins:maven-dependency-plugin:<br /> 2.8:copy (copy) on project jahia-test-module: Unable to find artifact. Could not<br /> &nbsp;find artifact org.jahia.modules:dummy1:jar:1.0 in jahia-public (<a href="https://devtool">https://devtool</a><br /> s.jahia.com/nexus/content/groups/public)<br /> [ERROR]<br /> [ERROR] Try downloading the file manually from the project website.<br /> [ERROR]<br /> [ERROR] Then, install it using the command:<br /> [ERROR] mvn install:install-file -DgroupId=org.jahia.modules -DartifactId=dummy1<br /> &nbsp;-Dversion=1.0 -Dpackaging=jar -Dfile=/path/to/file<br /> [ERROR]<br /> [ERROR] Alternatively, if you host your own repository you can deploy the file t<br /> here:<br /> [ERROR] mvn deploy:deploy-file -DgroupId=org.jahia.modules -DartifactId=dummy1 -<br /> Dversion=1.0 -Dpackaging=jar -Dfile=/path/to/file -Durl=[url] -DrepositoryId=[id<br /> ]</p>

  • Number of messages  4
    Registration date Apr 1, 2014
    0 (0 Good)
    0 (0 Bad)

    Re: mvn install - fail to execute

    by  shyrkov »  2014/04/01 10:10

    Hello John,

     

    sorry, there was an issue with our Maven repository. The artifacts are now avilable and the build (call mvn with "-U" option) should work.

     

    Kind regards

    Sergiy

     

  • Re: mvn install - fail to execute
    2014/04/01 10:10

    shyrkov <div class="content editablePost" id="editbdaf73ab-4f60-4e3f-ab4d-6e492045c45d"> <p> Hello John,</p> <p> &nbsp;</p> <p> sorry, there was an issue with our Maven repository. The artifacts are now avilable and the build (call mvn with &quot;-U&quot; option) should work.</p> <p> &nbsp;</p> <p> Kind regards</p> <p> Sergiy</p> </div> <p> &nbsp;</p>

  • Number of messages  407
    Registration date Apr 1, 2014
    0 (0 Good)
    0 (0 Bad)

    Re: Re: mvn install - fail to execute

    by  johnkim »  2014/04/02 02:16

    OK, Thanks.

    I've successfully "mvn install" execution.

    And when i execuete "mvn jahi:deploy jahia:configure", there is no error message.

    But where i execure tomcat's startup.bat file, there is error message.

     ---------------------------------------------------------------------------------------

    [GC 406000K->221911K(970752K), 0.0847946 secs]

     Error deploying web application directory C:\tomcat7\webapps\ROOT

    4월 02, 2014 11:01:35 오전 org.apache.catalina.core.ContainerBase addChildInternal
    심각: ContainerBase.addChild: start:
    org.apache.catalina.LifecycleException: Failed to start component [StandardEngin
    e[Catalina].StandardHost[localhost].StandardContext[]]
            at org.apache.catalina.util.LifecycleBase.start(LifecycleBase.java:154)
            at org.apache.catalina.core.ContainerBase.addChildInternal(ContainerBase
    .java:901)
            at org.apache.catalina.core.ContainerBase.addChild(ContainerBase.java:87
    7)
            at org.apache.catalina.core.StandardHost.addChild(StandardHost.java:632)

            at org.apache.catalina.startup.HostConfig.deployDirectory(HostConfig.jav
    a:1229)
            at org.apache.catalina.startup.HostConfig$DeployDirectory.run(HostConfig
    .java:1875)
            at java.util.concurrent.Executors$RunnableAdapter.call(Executors.java:47
    1)
            at java.util.concurrent.FutureTask.run(FutureTask.java:262)
            at java.util.concurrent.ThreadPoolExecutor.runWorker(ThreadPoolExecutor.
    java:1145)
            at java.util.concurrent.ThreadPoolExecutor$Worker.run(ThreadPoolExecutor
    .java:615)
            at java.lang.Thread.run(Thread.java:744)
    Caused by: java.lang.NoClassDefFoundError: org/apache/pluto/container/PortletCon
    tainerException
            at java.lang.Class.getDeclaredFields0(Native Method)
            at java.lang.Class.privateGetDeclaredFields(Class.java:2397)
            at java.lang.Class.getDeclaredFields(Class.java:1806)
            at org.apache.catalina.util.Introspection.getDeclaredFields(Introspectio
    n.java:106)
            at org.apache.catalina.startup.WebAnnotationSet.loadFieldsAnnotation(Web
    AnnotationSet.java:261)
            at org.apache.catalina.startup.WebAnnotationSet.loadApplicationListenerA
    nnotations(WebAnnotationSet.java:90)
            at org.apache.catalina.startup.WebAnnotationSet.loadApplicationAnnotatio
    ns(WebAnnotationSet.java:63)
            at org.apache.catalina.startup.ContextConfig.applicationAnnotationsConfi
    g(ContextConfig.java:400)
            at org.apache.catalina.startup.ContextConfig.configureStart(ContextConfi
    g.java:876)
            at org.apache.catalina.startup.ContextConfig.lifecycleEvent(ContextConfi
    g.java:371)
            at org.apache.catalina.util.LifecycleSupport.fireLifecycleEvent(Lifecycl
    eSupport.java:117)
            at org.apache.catalina.util.LifecycleBase.fireLifecycleEvent(LifecycleBa
    se.java:90)
            at org.apache.catalina.core.StandardContext.startInternal(StandardContex
    t.java:5355)
            at org.apache.catalina.util.LifecycleBase.start(LifecycleBase.java:150)
            ... 10 more
    Caused by: java.lang.ClassNotFoundException: org.apache.pluto.container.PortletC
    ontainerException
            at org.apache.catalina.loader.WebappClassLoader.loadClass(WebappClassLoa
    der.java:1720)
            at org.apache.catalina.loader.WebappClassLoader.loadClass(WebappClassLoa
    der.java:1571)
            ... 24 more

    4월 02, 2014 11:01:35 오전 org.apache.catalina.startup.HostConfig deployDirector
    y

     

  • Re: Re: mvn install - fail to execute
    2014/04/02 02:16

    johnkim <p> OK, Thanks.</p> <p> I&#39;ve successfully &quot;mvn install&quot; execution.</p> <p> And when i execuete &quot;mvn jahi:deploy jahia:configure&quot;, there is no error message.</p> <p> But where i execure tomcat&#39;s startup.bat file,&nbsp;there is error message.</p> <p> &nbsp;---------------------------------------------------------------------------------------</p> <p> <span class="short_text" id="result_box" lang="en"><span class="hps">[GC 406000K-&gt;221911K(970752K), 0.0847946 secs]</span></span></p> <p> <span class="short_text" id="result_box" lang="en"><span class="hps">&nbsp;Error deploying web application directory C:\tomcat7\webapps\ROOT</span></span></p> <p> <span class="short_text" id="result_box" lang="en"><span class="hps">4월 02, 2014 11:01:35 오전 org.apache.catalina.core.ContainerBase addChildInternal<br /> 심각: ContainerBase.addChild: start:<br /> org.apache.catalina.LifecycleException: Failed to start component [StandardEngin<br /> e[Catalina].StandardHost[localhost].StandardContext[]]<br /> &nbsp;&nbsp;&nbsp;&nbsp;&nbsp;&nbsp;&nbsp; at org.apache.catalina.util.LifecycleBase.start(LifecycleBase.java:154)<br /> &nbsp;&nbsp;&nbsp;&nbsp;&nbsp;&nbsp;&nbsp; at org.apache.catalina.core.ContainerBase.addChildInternal(ContainerBase<br /> .java:901)<br /> &nbsp;&nbsp;&nbsp;&nbsp;&nbsp;&nbsp;&nbsp; at org.apache.catalina.core.ContainerBase.addChild(ContainerBase.java:87<br /> 7)<br /> &nbsp;&nbsp;&nbsp;&nbsp;&nbsp;&nbsp;&nbsp; at org.apache.catalina.core.StandardHost.addChild(StandardHost.java:632)</span></span></p> <p> <span class="short_text" id="result_box" lang="en"><span class="hps">&nbsp;&nbsp;&nbsp;&nbsp;&nbsp;&nbsp;&nbsp; at org.apache.catalina.startup.HostConfig.deployDirectory(HostConfig.jav<br /> a:1229)<br /> &nbsp;&nbsp;&nbsp;&nbsp;&nbsp;&nbsp;&nbsp; at org.apache.catalina.startup.HostConfig$DeployDirectory.run(HostConfig<br /> .java:1875)<br /> &nbsp;&nbsp;&nbsp;&nbsp;&nbsp;&nbsp;&nbsp; at java.util.concurrent.Executors$RunnableAdapter.call(Executors.java:47<br /> 1)<br /> &nbsp;&nbsp;&nbsp;&nbsp;&nbsp;&nbsp;&nbsp; at java.util.concurrent.FutureTask.run(FutureTask.java:262)<br /> &nbsp;&nbsp;&nbsp;&nbsp;&nbsp;&nbsp;&nbsp; at java.util.concurrent.ThreadPoolExecutor.runWorker(ThreadPoolExecutor.<br /> java:1145)<br /> &nbsp;&nbsp;&nbsp;&nbsp;&nbsp;&nbsp;&nbsp; at java.util.concurrent.ThreadPoolExecutor$Worker.run(ThreadPoolExecutor<br /> .java:615)<br /> &nbsp;&nbsp;&nbsp;&nbsp;&nbsp;&nbsp;&nbsp; at java.lang.Thread.run(Thread.java:744)<br /> Caused by: java.lang.NoClassDefFoundError: org/apache/pluto/container/PortletCon<br /> tainerException<br /> &nbsp;&nbsp;&nbsp;&nbsp;&nbsp;&nbsp;&nbsp; at java.lang.Class.getDeclaredFields0(Native Method)<br /> &nbsp;&nbsp;&nbsp;&nbsp;&nbsp;&nbsp;&nbsp; at java.lang.Class.privateGetDeclaredFields(Class.java:2397)<br /> &nbsp;&nbsp;&nbsp;&nbsp;&nbsp;&nbsp;&nbsp; at java.lang.Class.getDeclaredFields(Class.java:1806)<br /> &nbsp;&nbsp;&nbsp;&nbsp;&nbsp;&nbsp;&nbsp; at org.apache.catalina.util.Introspection.getDeclaredFields(Introspectio<br /> n.java:106)<br /> &nbsp;&nbsp;&nbsp;&nbsp;&nbsp;&nbsp;&nbsp; at org.apache.catalina.startup.WebAnnotationSet.loadFieldsAnnotation(Web<br /> AnnotationSet.java:261)<br /> &nbsp;&nbsp;&nbsp;&nbsp;&nbsp;&nbsp;&nbsp; at org.apache.catalina.startup.WebAnnotationSet.loadApplicationListenerA<br /> nnotations(WebAnnotationSet.java:90)<br /> &nbsp;&nbsp;&nbsp;&nbsp;&nbsp;&nbsp;&nbsp; at org.apache.catalina.startup.WebAnnotationSet.loadApplicationAnnotatio<br /> ns(WebAnnotationSet.java:63)<br /> &nbsp;&nbsp;&nbsp;&nbsp;&nbsp;&nbsp;&nbsp; at org.apache.catalina.startup.ContextConfig.applicationAnnotationsConfi<br /> g(ContextConfig.java:400)<br /> &nbsp;&nbsp;&nbsp;&nbsp;&nbsp;&nbsp;&nbsp; at org.apache.catalina.startup.ContextConfig.configureStart(ContextConfi<br /> g.java:876)<br /> &nbsp;&nbsp;&nbsp;&nbsp;&nbsp;&nbsp;&nbsp; at org.apache.catalina.startup.ContextConfig.lifecycleEvent(ContextConfi<br /> g.java:371)<br /> &nbsp;&nbsp;&nbsp;&nbsp;&nbsp;&nbsp;&nbsp; at org.apache.catalina.util.LifecycleSupport.fireLifecycleEvent(Lifecycl<br /> eSupport.java:117)<br /> &nbsp;&nbsp;&nbsp;&nbsp;&nbsp;&nbsp;&nbsp; at org.apache.catalina.util.LifecycleBase.fireLifecycleEvent(LifecycleBa<br /> se.java:90)<br /> &nbsp;&nbsp;&nbsp;&nbsp;&nbsp;&nbsp;&nbsp; at org.apache.catalina.core.StandardContext.startInternal(StandardContex<br /> t.java:5355)<br /> &nbsp;&nbsp;&nbsp;&nbsp;&nbsp;&nbsp;&nbsp; at org.apache.catalina.util.LifecycleBase.start(LifecycleBase.java:150)<br /> &nbsp;&nbsp;&nbsp;&nbsp;&nbsp;&nbsp;&nbsp; ... 10 more<br /> Caused by: java.lang.ClassNotFoundException: org.apache.pluto.container.PortletC<br /> ontainerException<br /> &nbsp;&nbsp;&nbsp;&nbsp;&nbsp;&nbsp;&nbsp; at org.apache.catalina.loader.WebappClassLoader.loadClass(WebappClassLoa<br /> der.java:1720)<br /> &nbsp;&nbsp;&nbsp;&nbsp;&nbsp;&nbsp;&nbsp; at org.apache.catalina.loader.WebappClassLoader.loadClass(WebappClassLoa<br /> der.java:1571)<br /> &nbsp;&nbsp;&nbsp;&nbsp;&nbsp;&nbsp;&nbsp; ... 24 more</span></span></p> <p> <span class="short_text" id="result_box" lang="en"><span class="hps">4월 02, 2014 11:01:35 오전 org.apache.catalina.startup.HostConfig deployDirector<br /> y</span></span></p> <p> &nbsp;</p>

  • Number of messages  4
    Registration date Apr 2, 2014
    0 (0 Good)
    0 (0 Bad)

    Re: Re: Re: mvn install - fail to execute

    by  shyrkov »  2014/04/02 08:18

    Hello,

    which SVN project have you checked out from http://subversion.jahia.org/svn/ ?

    For the building and deploying Jahia from sources you should take jahia_community_dev project.

    Either version 7.0: http://subversion.jahia.org/svn/jahia_community_dev/releases/JAHIA_7_0_0_0/

    Or 6.6: http://subversion.jahia.org/svn/jahia_community_dev/releases/JAHIA_6_6_1_0/

     

    After checking the project out, you can call the scripts:

    install.bat

    deploy.bat

    configure.bat

     

    This will make the complete deployment of Jahia Web application and related shared libraries, which land into tomcat/lib folder (the exception, you get during startup is because those shared libraries are missing).

     

    Kind regards

    Sergiy

  • Re: Re: Re: mvn install - fail to execute
    2014/04/02 08:18

    shyrkov <p> Hello,</p> <p> which SVN project have you checked out from http://subversion.jahia.org/svn/ ?</p> <p> For the building and deploying Jahia from sources you should take jahia_community_dev project.</p> <p> Either version 7.0: http://subversion.jahia.org/svn/jahia_community_dev/releases/JAHIA_7_0_0_0/</p> <p> Or 6.6: http://subversion.jahia.org/svn/jahia_community_dev/releases/JAHIA_6_6_1_0/</p> <p> &nbsp;</p> <p> After checking the project out, you can call the scripts:</p> <p> install.bat</p> <p> deploy.bat</p> <p> configure.bat</p> <p> &nbsp;</p> <p> This will make the complete deployment of Jahia Web application and related shared libraries, which land into tomcat/lib folder (the exception, you get during startup is because those shared libraries are missing).</p> <p> &nbsp;</p> <p> Kind regards</p> <p> Sergiy</p>

  • Number of messages  407
    Registration date Apr 2, 2014
    0 (0 Good)
    0 (0 Bad)

    Re: Re: Re: Re: mvn install - fail to execute

    by  / »  2014/04/03 06:00

    Hello Sergiy,

    I checked out from http://subversion.jahia.org/svn/jahia/trunk.

    1. Today, when i check out jahia_7_0_0_0, ask me about login id /password.


    2. In case jahia_6_6_1_0,
    occured building Jahia test module error during mvn installation.
     

    [ERROR] COMPILATION ERROR :
    [INFO] -------------------------------------------------------------
    [ERROR] error: error reading C:\development\m2repository\org\apache\jackrabbit\j
    ackrabbit-jcr-tests\2.2.4-rev1068882-patch9\jackrabbit-jcr-tests-2.2.4-rev1068882-patch9.jar; error in opening zip file
    [ERROR] error: error reading C:\development\m2repository\org\mockejb\mockejb\0.6-beta2\mockejb-0.6-beta2.jar; error in opening zip file
    [ERROR] error: error reading C:\development\m2repository\org\subethamail\subetha
    smtp-wiser\1.2\subethasmtp-wiser-1.2.jar; error in opening zip file
    [ERROR] error: error reading C:\development\m2repository\net\sf\jasperreports\ja
    sperreports\4.0.1\jasperreports-4.0.1.jar; error in opening zip file
    [INFO] 4 errors

    /
    Number of messages  1
    Not registered
    0 (0 Good)
    0 (0 Bad)

    Re: Re: Re: Re: Re: mvn install - fail to execute

    by  shyrkov »  2014/04/03 08:18

    Hello,

    sorry for this issue: there was a nightly SVN synchronization problem. We've fixed it now.

    Please do the following:

    1) svn co https://devtools.jahia.com/svn/jahia_community_dev/releases/JAHIA_7_0_0_0/ jahia-community-dev-7.0.0.0

    2) cd jahia-community-dev-7.0.0.0

    3) install

    4) deploy

    5) configure

     

    Let me know, please, if there are any remaing issues.

    Kind regards

    Sergiy

     

  • Re: Re: Re: Re: Re: mvn install - fail to execute
    2014/04/03 08:18

    shyrkov <div class="content editablePost" id="edit0c133405-0a4d-4c1c-aafd-9e2e9a31f786"> <p> Hello,</p> <p> sorry for this issue: there was a nightly SVN synchronization problem. We&#39;ve fixed it now.</p> <p> Please do the following:</p> <p> 1) svn co https://devtools.jahia.com/svn/jahia_community_dev/releases/JAHIA_7_0_0_0/ jahia-community-dev-7.0.0.0</p> <p> 2) cd jahia-community-dev-7.0.0.0</p> <p> 3) install</p> <p> 4) deploy</p> <p> 5) configure</p> <p> &nbsp;</p> <p> Let me know, please, if there are any remaing issues.</p> <p> Kind regards</p> <p> Sergiy</p> </div> <p> &nbsp;</p>

  • Number of messages  407
    Registration date Apr 3, 2014
    0 (0 Good)
    0 (0 Bad)

    Re: Re: Re: Re: Re: Re: mvn install - fail to execute

    by  johnkim »  2014/04/03 10:35

    Thanks Sergiy,

    Finally, i succesfully install jahia7.

    Regards,

    John Kim

     

  • Re: Re: Re: Re: Re: Re: mvn install - fail to execute
    2014/04/03 10:35

    johnkim <p> Thanks Sergiy,</p> <p> Finally, i succesfully install jahia7.</p> <p> Regards,</p> <p> John Kim</p> <p> &nbsp;</p>

  • Number of messages  4
    Registration date Apr 3, 2014
    0 (0 Good)
    0 (0 Bad)

    Re : Re: Re: Re: mvn install - fail to execute

    by  Romain »  2015/06/30 10:56

    It seems that the zipfile Bug is still present for JAHIA_6_6_1_0

    [ERROR] Failed to execute goal org.apache.maven.plugins:maven-compiler-plugin:2.3.2:compile (default-compile) on project jahia-test-module: Compilation failure
    [ERROR] error: error reading /home/romain/.m2/repository/org/apache/jackrabbit/jackrabbit-jcr-tests/2.2.4-rev1068882-patch9/jackrabbit-jcr-tests-2.2.4-rev1068882-patch9.jar; error in opening zip file
    [ERROR] -> [Help 1]

    How do you compile Jahia 6.6.1.0 ?

     

     

    Romain
    Number of messages  1
    Not registered
    Contact
    Share
    Feedback

    Get in touch

    Whether you are a current user or if you are just evaluating Jahia, we are here to help.

    Contact us

    Share this page